Reaction Details
TargetVascular endothelial growth factor receptor 2
LigandBDBM50177852
Substrate/Competitorn/a
Meas. Tech.ChEMBL_326138 (CHEMBL864514)
IC50<1±n/a nM
Citation Wissner, AFloyd, MBJohnson, BDFraser, HIngalls, CNittoli, TDushin, RGDiscafani, CNilakantan, RMarini, JRavi, MCheung, KTan, XMusto, SAnnable, TSiegel, MMLoganzo, F 2-(Quinazolin-4-ylamino)-[1,4]benzoquinones as covalent-binding, irreversible inhibitors of the kinase domain of vascular endothelial growth factor receptor-2. J Med Chem48:7560-81 (2005) 
 
Vascular endothelial growth factor receptor 2
Name:Vascular endothelial growth factor receptor 2
Type:Receptor Tyrosine Kinase
Mol. Mass.:151510.97
Organism:Homo sapiens (Human)
Description:P35968
Residue:1356
BDBM50177852
NameBDBM50177852
Synonyms:3-Chloro-2-ethoxy-5-{[6-methoxy-7-(2-methoxyethoxy)quinazolin-4-yl]amino}benzo-1,4-quinone | CHEMBL200765
TypeSmall organic molecule
Emp. Form.C20H20ClN3O6
Mol. Mass.433.842
SMILESCCOC1=C(Cl)C(=O)C(Nc2ncnc3cc(OCCOC)c(OC)cc23)=CC1=O