Reaction Details
TargetVascular endothelial growth factor receptor 2
LigandBDBM50177803
Substrate/Competitorn/a
Meas. Tech.ChEMBL_326140 (CHEMBL862695)
IC50 3.7±n/a nM
Citation Wissner, AFloyd, MBJohnson, BDFraser, HIngalls, CNittoli, TDushin, RGDiscafani, CNilakantan, RMarini, JRavi, MCheung, KTan, XMusto, SAnnable, TSiegel, MMLoganzo, F 2-(Quinazolin-4-ylamino)-[1,4]benzoquinones as covalent-binding, irreversible inhibitors of the kinase domain of vascular endothelial growth factor receptor-2. J Med Chem48:7560-81 (2005) 
 
Vascular endothelial growth factor receptor 2
Name:Vascular endothelial growth factor receptor 2
Type:Receptor Tyrosine Kinase
Mol. Mass.:151510.97
Organism:Homo sapiens (Human)
Description:P35968
Residue:1356
BDBM50177803
NameBDBM50177803
Synonyms:2-[2-Fluoro-1-(fluoromethyl)ethoxy]-5-({6-methoxy-7-[(1-methylpiperidin-4-yl)methoxy]quinazolin-4-yl}amino)benzo-1,4-quinone | CHEMBL200425
TypeSmall organic molecule
Emp. Form.C25H28F2N4O5
Mol. Mass.502.5104
SMILESCOc1cc2c(N=C3CC(=O)C(OC(CF)CF)=CC3=O)ncnc2cc1OCC1CCN(C)CC1