Reaction Details
TargetDual specificity protein phosphatase 3
LigandBDBM50179012
Substrate/Competitorn/a
Meas. Tech.ChEMBL_339771 (CHEMBL862182)
IC50>80000±n/a nM
Citation Cui, LNa, MOh, HBae, EYJeong, DGRyu, SEKim, SKim, BYOh, WKAhn, JS Protein tyrosine phosphatase 1B inhibitors from Morus root bark. Bioorg Med Chem Lett16:1426-9 (2006) 
 
Dual specificity protein phosphatase 3
Name:Dual specificity protein phosphatase 3
Type:Hydrolase
Mol. Mass.:20480.58
Organism:Homo sapiens (Human)
Description:n/a
Residue:185
BDBM50179012
NameBDBM50179012
Synonyms:CHEMBL382338 | Sanggenon G
TypeSmall organic molecule
Emp. Form.C40H38O11
Mol. Mass.694.7231
SMILES[#6]\[#6](-[#6])=[#6]\[#6]-[#6]-[#6]-1=[#6]-[#6@@H](-[#6@H](-[#6@@H](-[#6]-1)-c1ccc(-[#8])cc1-[#8])-[#6](=O)-c1ccc(-[#8])cc1-[#8])-c1c(-[#8])cc2-[#8]-[#6@@H](-[#6]-[#6](=O)-c2c1-[#8])-c1cc(-[#8])ccc1-[#8]