Reaction Details
TargetHistone acetyltransferase KAT2A
LigandBDBM50600305
Substrate/Competitorn/a
Meas. Tech.ChEMBL_2233609 (CHEMBL5147381)
IC50>50000±n/a nM
Citation Kanada, RKagoshima, YAsano, MSuzuki, TMurata, THaruta, MTakahashi, MUbukata, OHashimoto, KObata, KKihara, KKuroha, MBanjo, TTogashi, NSato, KYamamoto, YSuzuki, KIsoyama, TTominaga, YHiguchi, SNaito, H Discovery of EP300/CBP histone acetyltransferase inhibitors through scaffold hopping of 1,4-oxazepane ring. Bioorg Med Chem Lett66:0 (2022) 
 
Histone acetyltransferase KAT2A
Name:Histone acetyltransferase KAT2A
Type:PROTEIN
Mol. Mass.:93956.22
Organism:Homo sapiens (Human)
Description:ChEMBL_100876
Residue:837
BDBM50600305
NameBDBM50600305
Synonyms:CHEMBL5193672
TypeSmall organic molecule
Emp. Form.C24H26N4O5S
Mol. Mass.482.552
SMILESCOc1ccc(cc1)C1(CCCC1)C(=O)N1CS(=O)(=O)C[C@@H]1C(=O)Nc1cccc2[nH]ncc12