Reaction Details
TargetCathepsin K
LigandBDBM50165424
Substrate/Competitorn/a
Meas. Tech.ChEMBL_341068 (CHEMBL866588)
IC50 3±n/a nM
Citation Barrett, DGCatalano, JGDeaton, DNHassell, AMLong, STMiller, ABMiller, LRRay, JASamano, VShewchuk, LMWells-Knecht, KJWillard, DHWright, LL Novel, potent P2-P3 pyrrolidine derivatives of ketoamide-based cathepsin K inhibitors. Bioorg Med Chem Lett16:1735-9 (2006) 
 
Cathepsin K
Name:Cathepsin K
Type:Enzyme
Mol. Mass.:36975.68
Organism:Homo sapiens (Human)
Description:P43235
Residue:329
BDBM50165424
NameBDBM50165424
Synonyms:(S)-4,4-dimethyl-2-oxo-tetrahydrofuran-3-yl (S)-1,2-dioxo-1-((R)-1-phenylethylamino)heptan-3-ylcarbamate [(S)-1-((R)-1-Phenyl-ethylaminooxalyl)-pentyl]-carbamic acid (S)-4,4-dimethyl-2-oxo-tetrahydro-furan-3-yl ester
TypeSmall organic molecule
Emp. Form.C22H30N2O6
Mol. Mass.418.4834
SMILESCCCC[C@H](NC(=O)O[C@@H]1C(=O)OCC1(C)C)C(=O)C(=O)N[C@H](C)c1ccccc1