Reaction Details
TargetPhosphotransferase
LigandBDBM50138049
Substrate/Competitorn/a
Meas. Tech.ChEMBL_330068 (CHEMBL865780)
IC50 1450±n/a nM
Citation Hudock, MPSanz-Rodríguez, CESong, YChan, JMZhang, YOdeh, SKosztowski, TLeon-Rossell, AConcepción, JLYardley, VCroft, SLUrbina, JAOldfield, E Inhibition of Trypanosoma cruzi hexokinase by bisphosphonates. J Med Chem49:215-23 (2006) 
 
Phosphotransferase
Name:Phosphotransferase
Synonyms:Hexokinase
Type:PROTEIN
Mol. Mass.:52180.94
Organism:Trypanosoma cruzi
Description:ChEMBL_330068
Residue:471
BDBM50138049
NameBDBM50138049
TypeSmall organic molecule
Emp. Form.C14H25NO6P2
Mol. Mass.365.2989
SMILESCCCCCCCc1ccc(NC(P(O)(O)=O)P(O)(O)=O)cc1