Reaction Details
TargetPhosphotransferase
LigandBDBM50180152
Substrate/Competitorn/a
Meas. Tech.ChEMBL_330068 (CHEMBL865780)
IC50 810±n/a nM
Citation Hudock, MPSanz-Rodríguez, CESong, YChan, JMZhang, YOdeh, SKosztowski, TLeon-Rossell, AConcepción, JLYardley, VCroft, SLUrbina, JAOldfield, E Inhibition of Trypanosoma cruzi hexokinase by bisphosphonates. J Med Chem49:215-23 (2006) 
 
Phosphotransferase
Name:Phosphotransferase
Synonyms:Hexokinase
Type:PROTEIN
Mol. Mass.:52180.94
Organism:Trypanosoma cruzi
Description:ChEMBL_330068
Residue:471
BDBM50180152
NameBDBM50180152
TypeSmall organic molecule
Emp. Form.C15H18N2O6P2
Mol. Mass.384.2607
SMILESCCn1c2ccccc2c2cc(NC(P(O)(O)=O)P(O)(O)=O)ccc12