Reaction Details
TargetPlasma kallikrein
LigandBDBM14903
Substrate/Competitorn/a
Meas. Tech.ChEMBL_344178 (CHEMBL868878)
Ki 13±n/a nM
Citation Young, WBRai, RShrader, WDBurgess-Henry, JHu, HElrod, KCSprengeler, PAKatz, BASukbuntherng, JMordenti, J Small molecule inhibitors of plasma kallikrein. Bioorg Med Chem Lett16:2034-6 (2006) 
 
Plasma kallikrein
Name:Plasma kallikrein
Type:Protein
Mol. Mass.:71391.16
Organism:Homo sapiens (Human)
Description:P03952
Residue:638
BDBM14903
NameBDBM14903
Synonyms:2-[3-(5-carbamimidoyl-1H-1,3-benzodiazol-2-yl)-4-hydroxy-5-(2-hydroxyphenyl)phenyl]butanedioic acid CHEMBL444622
TypeSmall organic molecule
Emp. Form.C24H20N4O6
Mol. Mass.460.4388
SMILESNC(=N)c1ccc2nc([nH]c2c1)-c1cc(cc(c1O)-c1ccccc1O)C(CC(O)=O)C(O)=O