Reaction Details
TargetMatrix metalloproteinase-15
LigandBDBM50180601
Substrate/Competitorn/a
Meas. Tech.ChEMBL_330172 (CHEMBL863525)
IC50 13940±n/a nM
Citation Ma, DJiang, YChen, FGong, LKDing, KXu, YWang, RGe, ARen, JLi, JLi, JYe, Q Selective inhibition of matrix metalloproteinase isozymes and in vivo protection against emphysema by substituted gamma-keto carboxylic acids. J Med Chem49:456-8 (2006) 
 
Matrix metalloproteinase-15
Name:Matrix metalloproteinase-15
Type:PROTEIN
Mol. Mass.:75814.08
Organism:Homo sapiens (Human)
Description:ChEMBL_106793
Residue:669
BDBM50180601
NameBDBM50180601
Synonyms:3-(4-(2-phenylethynyl)benzoyl)pentanoic acid | CHEMBL202875
TypeSmall organic molecule
Emp. Form.C20H18O3
Mol. Mass.306.3551
SMILESCCC(CC(O)=O)C(=O)c1ccc(cc1)C#Cc1ccccc1