Reaction Details
TargetMatrix metalloproteinase-16
LigandBDBM50062351
Substrate/Competitorn/a
Meas. Tech.ChEMBL_330173 (CHEMBL863526)
IC50 8±n/a nM
Citation Ma, DJiang, YChen, FGong, LKDing, KXu, YWang, RGe, ARen, JLi, JLi, JYe, Q Selective inhibition of matrix metalloproteinase isozymes and in vivo protection against emphysema by substituted gamma-keto carboxylic acids. J Med Chem49:456-8 (2006) 
 
Matrix metalloproteinase-16
Name:Matrix metalloproteinase-16
Type:PROTEIN
Mol. Mass.:69536.76
Organism:Homo sapiens (Human)
Description:ChEMBL_799129
Residue:607
BDBM50062351
NameBDBM50062351
Synonyms:(R)-N*4*-Hydroxy-N*1*-[(S)-2-(1H-indol-3-yl)-1-methylcarbamoyl-ethyl]-2-isobutyl-succinamide (R)-N1-((S)-3-(1H-indol-3-yl)-1-(methylamino)-1-oxopropan-2-yl)-N4-hydroxy-2-isobutylsuccinamide CHEMBL19611 US9487462, ilomastat
TypeSmall organic molecule
Emp. Form.C20H28N4O4
Mol. Mass.388.4607
SMILESCNC(=O)[C@H](Cc1c[nH]c2ccccc12)NC(=O)[C@H](CC(C)C)CC(=O)NO