Reaction Details
TargetCollagenase 3
LigandBDBM50181006
Substrate/Competitorn/a
Meas. Tech.ChEMBL_339181 (CHEMBL867737)
IC50 1±n/a nM
Citation Levin, JIChen, JMLaakso, LMDu, MSchmid, JXu, WCummons, TXu, JJin, GBarone, DSkotnicki, JS Acetylenic TACE inhibitors. Part 3: Thiomorpholine sulfonamide hydroxamates. Bioorg Med Chem Lett16:1605-9 (2006) 
 
Collagenase 3
Name:Collagenase 3
Type:Enzyme
Mol. Mass.:53808.06
Organism:Homo sapiens (Human)
Description:P45452
Residue:471
BDBM50181006
NameBDBM50181006
Synonyms:(S)-4-(4-(but-3-ynyloxy)phenylsulfonyl)-N-hydroxy-2,2-dimethylthiomorpholine-3-carboxamide | CHEMBL206688
TypeSmall organic molecule
Emp. Form.C17H22N2O5S2
Mol. Mass.398.497
SMILESCC1(C)SCCN([C@H]1C(=O)NO)S(=O)(=O)c1ccc(OCCC#C)cc1