Reaction Details
TargetInterstitial collagenase
LigandBDBM23498
Substrate/Competitorn/a
Meas. Tech.ChEMBL_339180 (CHEMBL867736)
IC50 7±n/a nM
Citation Levin, JIChen, JMLaakso, LMDu, MSchmid, JXu, WCummons, TXu, JJin, GBarone, DSkotnicki, JS Acetylenic TACE inhibitors. Part 3: Thiomorpholine sulfonamide hydroxamates. Bioorg Med Chem Lett16:1605-9 (2006) 
 
Interstitial collagenase
Name:Interstitial collagenase
Type:Enzyme
Mol. Mass.:54010.26
Organism:Homo sapiens (Human)
Description: P03956
Residue:469
BDBM23498
NameBDBM23498
Synonyms:(3S)-4-{[4-(but-2-yn-1-yloxy)benzene]sulfonyl}-N-hydroxy-2,2-dimethylthiomorpholine-3-carboxamide TMI-1
TypeSmall organic molecule
Emp. Form.C17H22N2O5S2
Mol. Mass.398.497
SMILESCC#CCOc1ccc(cc1)S(=O)(=O)N1CCSC(C)(C)[C@@H]1C(=O)NO