Reaction Details
TargetMetabotropic glutamate receptor 5
LigandBDBM50181069
Substrate/Competitorn/a
Meas. Tech.ChEMBL_345726 (CHEMBL860880)
Ki 45±n/a nM
Citation Büttelmann, BPeters, JUCeccarelli, SKolczewski, SVieira, EPrinssen, EPSpooren, WSchuler, FHuwyler, JPorter, RHJaeschke, G Arylmethoxypyridines as novel, potent and orally active mGlu5 receptor antagonists. Bioorg Med Chem Lett16:1892-7 (2006) 
 
Metabotropic glutamate receptor 5
Name:Metabotropic glutamate receptor 5
Type:Enzyme
Mol. Mass.:132484.72
Organism:Homo sapiens (Human)
Description:n/a
Residue:1212
BDBM50181069
NameBDBM50181069
Synonyms:2-(3-chlorobenzyloxy)-4-(2,5-dimethyl-1H-pyrrol-1-yl)-6-methylpyridine | CHEMBL205606
TypeSmall organic molecule
Emp. Form.C19H19ClN2O
Mol. Mass.326.82
SMILESCc1ccc(C)n1-c1cc(C)nc(OCc2cccc(Cl)c2)c1