Reaction Details
TargetMetabotropic glutamate receptor 5
LigandBDBM50181077
Substrate/Competitorn/a
Meas. Tech.ChEMBL_345726 (CHEMBL860880)
Ki 18±n/a nM
Citation Büttelmann, BPeters, JUCeccarelli, SKolczewski, SVieira, EPrinssen, EPSpooren, WSchuler, FHuwyler, JPorter, RHJaeschke, G Arylmethoxypyridines as novel, potent and orally active mGlu5 receptor antagonists. Bioorg Med Chem Lett16:1892-7 (2006) 
 
Metabotropic glutamate receptor 5
Name:Metabotropic glutamate receptor 5
Type:Enzyme
Mol. Mass.:132484.72
Organism:Homo sapiens (Human)
Description:n/a
Residue:1212
BDBM50181077
NameBDBM50181077
Synonyms:CHEMBL204062 | N-(2-(3-chlorobenzyloxy)-6-methylpyridin-4-yl)-2,2,2-trifluoro-N-methylacetamide
TypeSmall organic molecule
Emp. Form.C16H14ClF3N2O2
Mol. Mass.358.743
SMILESCN(C(=O)C(F)(F)F)c1cc(C)nc(OCc2cccc(Cl)c2)c1