Reaction Details
TargetMetabotropic glutamate receptor 5
LigandBDBM50181081
Substrate/Competitorn/a
Meas. Tech.ChEMBL_345726 (CHEMBL860880)
Ki 44±n/a nM
Citation Büttelmann, BPeters, JUCeccarelli, SKolczewski, SVieira, EPrinssen, EPSpooren, WSchuler, FHuwyler, JPorter, RHJaeschke, G Arylmethoxypyridines as novel, potent and orally active mGlu5 receptor antagonists. Bioorg Med Chem Lett16:1892-7 (2006) 
 
Metabotropic glutamate receptor 5
Name:Metabotropic glutamate receptor 5
Type:Enzyme
Mol. Mass.:132484.72
Organism:Homo sapiens (Human)
Description:n/a
Residue:1212
BDBM50181081
NameBDBM50181081
Synonyms:1-(2-(3-chlorobenzyloxy)-6-methylpyridin-4-yl)-2-methyl-1H-imidazole-4-carboxamide | CHEMBL204404
TypeSmall organic molecule
Emp. Form.C18H17ClN4O2
Mol. Mass.356.806
SMILESCc1nc(cn1-c1cc(C)nc(OCc2cccc(Cl)c2)c1)C(N)=O