Reaction Details
TargetMetabotropic glutamate receptor 5
LigandBDBM50181080
Substrate/Competitorn/a
Meas. Tech.ChEMBL_345726 (CHEMBL860880)
Ki 51±n/a nM
Citation Büttelmann, BPeters, JUCeccarelli, SKolczewski, SVieira, EPrinssen, EPSpooren, WSchuler, FHuwyler, JPorter, RHJaeschke, G Arylmethoxypyridines as novel, potent and orally active mGlu5 receptor antagonists. Bioorg Med Chem Lett16:1892-7 (2006) 
 
Metabotropic glutamate receptor 5
Name:Metabotropic glutamate receptor 5
Type:Enzyme
Mol. Mass.:132484.72
Organism:Homo sapiens (Human)
Description:n/a
Residue:1212
BDBM50181080
NameBDBM50181080
Synonyms:2-(3-(benzyloxy)-5-methylphenyl)isoindoline-1,3-dione | CHEMBL381764
TypeSmall organic molecule
Emp. Form.C22H17NO3
Mol. Mass.343.3753
SMILESCc1cc(OCc2ccccc2)cc(c1)N1C(=O)c2ccccc2C1=O