Reaction Details
TargetRNA-directed RNA polymerase
LigandBDBM50181634
Substrate/Competitorn/a
Meas. Tech.ChEMBL_330651 (CHEMBL867029)
IC50 32±n/a nM
Citation Tedesco, RShaw, ANBambal, RChai, DConcha, NODarcy, MGDhanak, DFitch, DMGates, AGerhardt, WGHalegoua, DLHan, CHofmann, GAJohnston, VKKaura, ACLiu, NKeenan, RMLin-Goerke, JSarisky, RTWiggall, KJZimmerman, MNDuffy, KJ 3-(1,1-dioxo-2H-(1,2,4)-benzothiadiazin-3-yl)-4-hydroxy-2(1H)-quinolinones, potent inhibitors of hepatitis C virus RNA-dependent RNA polymerase. J Med Chem49:971-83 (2006) 
 
RNA-directed RNA polymerase
Name:RNA-directed RNA polymerase
Type:Protein
Mol. Mass.:25173.95
Organism:Hepatitis C virus
Description:Q8JXU8
Residue:229
BDBM50181634
NameBDBM50181634
Synonyms:6-Amino-1-(2-cyclopropylethyl)-3-(1,1-dioxo-1,4-dihydrobenzo[1,2,4]thiadiazin-3- | CHEMBL203426
TypeSmall organic molecule
Emp. Form.C21H20N4O4S
Mol. Mass.424.473
SMILESNc1ccc2n(CCC3CC3)c(=O)c(C3=Nc4ccccc4S(=O)(=O)N3)c(O)c2c1