Reaction Details
TargetRNA-directed RNA polymerase
LigandBDBM50181659
Substrate/Competitorn/a
Meas. Tech.ChEMBL_330651 (CHEMBL867029)
IC50 172±n/a nM
Citation Tedesco, RShaw, ANBambal, RChai, DConcha, NODarcy, MGDhanak, DFitch, DMGates, AGerhardt, WGHalegoua, DLHan, CHofmann, GAJohnston, VKKaura, ACLiu, NKeenan, RMLin-Goerke, JSarisky, RTWiggall, KJZimmerman, MNDuffy, KJ 3-(1,1-dioxo-2H-(1,2,4)-benzothiadiazin-3-yl)-4-hydroxy-2(1H)-quinolinones, potent inhibitors of hepatitis C virus RNA-dependent RNA polymerase. J Med Chem49:971-83 (2006) 
 
RNA-directed RNA polymerase
Name:RNA-directed RNA polymerase
Type:Protein
Mol. Mass.:25173.95
Organism:Hepatitis C virus
Description:Q8JXU8
Residue:229
BDBM50181659
NameBDBM50181659
Synonyms:4-[3-(1,1-dioxo-1,2-dihydrobenzo[1,2,4]benzothiadiazin-3-yl)-4-hydroxy-2-oxo-1Hquinolinyl]butyrronitrile | CHEMBL201567
TypeSmall organic molecule
Emp. Form.C20H16N4O4S
Mol. Mass.408.43
SMILESOc1c(C2=Nc3ccccc3S(=O)(=O)N2)c(=O)n(CCCC#N)c2ccccc12