Reaction Details
TargetCytochrome P450 2C9
LigandBDBM50181559
Substrate/Competitorn/a
Meas. Tech.ChEMBL_330719 (CHEMBL861912)
IC50 1000±n/a nM
Citation Tedesco, RShaw, ANBambal, RChai, DConcha, NODarcy, MGDhanak, DFitch, DMGates, AGerhardt, WGHalegoua, DLHan, CHofmann, GAJohnston, VKKaura, ACLiu, NKeenan, RMLin-Goerke, JSarisky, RTWiggall, KJZimmerman, MNDuffy, KJ 3-(1,1-dioxo-2H-(1,2,4)-benzothiadiazin-3-yl)-4-hydroxy-2(1H)-quinolinones, potent inhibitors of hepatitis C virus RNA-dependent RNA polymerase. J Med Chem49:971-83 (2006) 
 
Cytochrome P450 2C9
Name:Cytochrome P450 2C9
Type:Enzyme
Mol. Mass.:55636.33
Organism:Homo sapiens (Human)
Description:P11712
Residue:490
BDBM50181559
NameBDBM50181559
Synonyms:1-(2-CYCLOPROPYLETHYL)-3-(1,1-DIOXIDO-2H-1,2,4-BENZOTHIADIAZIN-3-YL)-6-FLUORO-4-HYDROXYQUINOLIN-2(1H)-ONE 1-(2-cyclopropylethyl)-3-(1,1-dioxo-1,4-dihydrobenzo[1,2,4]-thiadiazin-3-yl) -6-fluoro-4-hydroxy-1-quinolin-2-one | CHEMBL372357
TypeSmall organic molecule
Emp. Form.C21H18FN3O4S
Mol. Mass.427.449
SMILESOc1c(C2=Nc3ccccc3S(=O)(=O)N2)c(=O)n(CCC2CC2)c2ccc(F)cc12