Reaction Details
TargetMetabotropic glutamate receptor 5
LigandBDBM50181753
Substrate/Competitorn/a
Meas. Tech.ChEMBL_331632 (CHEMBL862888)
Ki 0.71±n/a nM
Citation Iso, YGrajkowska, EWroblewski, JTDavis, JGoeders, NEJohnson, KMSanker, SRoth, BLTueckmantel, WKozikowski, AP Synthesis and structure-activity relationships of 3-[(2-methyl-1,3-thiazol-4-yl)ethynyl]pyridine analogues as potent, noncompetitive metabotropic glutamate receptor subtype 5 antagonists; search for cocaine medications. J Med Chem49:1080-100 (2006) 
 
Metabotropic glutamate receptor 5
Name:Metabotropic glutamate receptor 5
Type:Enzyme
Mol. Mass.:131900.14
Organism:Rattus norvegicus (Rat)
Description:P31424
Residue:1203
BDBM50181753
NameBDBM50181753
Synonyms:3-[(2-methyl-4-thiazolyl)ethynyl]-5-vinylpyridine US8609852, 78
TypeSmall organic molecule
Emp. Form.C13H10N2S
Mol. Mass.226.297
SMILESCc1nc(cs1)C#Cc1cncc(C=C)c1