Reaction Details
TargetAdenosine receptor A3
LigandBDBM50182316
Substrate/Competitorn/a
Meas. Tech.ChEMBL_349357 (CHEMBL865062)
Ki>3000±n/a nM
Citation DeNinno, MPMasamune, HChenard, LKDiRico, KJEller, CEtienne, JBTickner, JEKennedy, SPKnight, DRKong, JOleynek, JJTracey, WRHill, RJ The synthesis of highly potent, selective, and water-soluble agonists at the human adenosine A3 receptor. Bioorg Med Chem Lett16:2525-7 (2006) 
 
Adenosine receptor A3
Name:Adenosine receptor A3
Type:G Protein-Coupled Receptor (GPCR)
Mol. Mass.:36197.32
Organism:Homo sapiens (Human)
Description:P0DMS8
Residue:318
BDBM50182316
NameBDBM50182316
Synonyms:1-ethyl-3-((2S,3S,4R,5R)-4-hydroxy-5-(6-(methylamino)-9H-purin-9-yl)-2-(methylcarbamoyl)-tetrahydrofuran-3-yl)urea | CHEMBL380460
TypeSmall organic molecule
Emp. Form.C15H22N8O4
Mol. Mass.378.3864
SMILESCCNC(=O)N[C@H]1[C@@H](O)[C@@H](O[C@@H]1C(=O)NC)n1cnc2c(NC)ncnc12