Reaction Details
TargetMetabotropic glutamate receptor 5
LigandBDBM50182823
Substrate/Competitorn/a
Meas. Tech.ChEMBL_348518 (CHEMBL865700)
IC50 80±n/a nM
Citation Hammerland, LGJohansson, MMalmström, JMattsson, JPMinidis, ABNilsson, KPeterson, AWensbo, DWållberg, AOsterlund, K Structure-activity relationship of thiopyrimidines as mGluR5 antagonists. Bioorg Med Chem Lett16:2467-9 (2006) 
 
Metabotropic glutamate receptor 5
Name:Metabotropic glutamate receptor 5
Type:Enzyme
Mol. Mass.:132484.72
Organism:Homo sapiens (Human)
Description:n/a
Residue:1212
BDBM50182823
NameBDBM50182823
Synonyms:4-(3,4-dichlorophenylthio)-2-(5-fluoropyridin-2-yl)pyrimidine | CHEMBL208505
TypeSmall organic molecule
Emp. Form.C15H8Cl2FN3S
Mol. Mass.352.214
SMILESFc1ccc(nc1)-c1nccc(Sc2ccc(Cl)c(Cl)c2)n1