Reaction Details
TargetCytochrome P450 2C9
LigandBDBM50183186
Substrate/Competitorn/a
Meas. Tech.ChEMBL_354697 (CHEMBL870679)
IC50 6800±n/a nM
Citation Hall, ABit, RABrown, SHChaignot, HMChessell, IPColeman, TGiblin, GMHurst, DNKilford, IRLewell, XQMichel, ADMohamed, SNaylor, ANovelli, RSkinner, LSpalding, DJTang, SPWilson, RJ Discovery of novel biaryl heterocyclic EP1 receptor antagonists. Bioorg Med Chem Lett16:2666-71 (2006) 
 
Cytochrome P450 2C9
Name:Cytochrome P450 2C9
Type:Enzyme
Mol. Mass.:55636.33
Organism:Homo sapiens (Human)
Description:P11712
Residue:490
BDBM50183186
NameBDBM50183186
Synonyms:3-(2-(2-(benzyloxy)-5-bromophenyl)-5-methyl-1H-pyrrol-1-yl)benzoic acid | CHEMBL377649
TypeSmall organic molecule
Emp. Form.C25H20BrNO3
Mol. Mass.462.335
SMILESCc1ccc(-c2cc(Br)ccc2OCc2ccccc2)n1-c1cccc(c1)C(O)=O