Reaction Details
TargetCytochrome P450 1A2
LigandBDBM50183183
Substrate/Competitorn/a
Meas. Tech.ChEMBL_354702 (CHEMBL853122)
IC50>50000±n/a nM
Citation Hall, ABit, RABrown, SHChaignot, HMChessell, IPColeman, TGiblin, GMHurst, DNKilford, IRLewell, XQMichel, ADMohamed, SNaylor, ANovelli, RSkinner, LSpalding, DJTang, SPWilson, RJ Discovery of novel biaryl heterocyclic EP1 receptor antagonists. Bioorg Med Chem Lett16:2666-71 (2006) 
 
Cytochrome P450 1A2
Name:Cytochrome P450 1A2
Type:Enzyme
Mol. Mass.:58423.38
Organism:Homo sapiens (Human)
Description:P05177
Residue:516
BDBM50183183
NameBDBM50183183
Synonyms:3-(3-(2-(benzyloxy)-5-chlorophenyl)pyridin-2-yl)benzoic acid | CHEMBL206096
TypeSmall organic molecule
Emp. Form.C25H18ClNO3
Mol. Mass.415.868
SMILESOC(=O)c1cccc(c1)-c1ncccc1-c1cc(Cl)ccc1OCc1ccccc1