Reaction Details
TargetCytochrome P450 3A4
LigandBDBM50183238
Substrate/Competitorn/a
Meas. Tech.ChEMBL_355280 (CHEMBL853201)
IC50 2270±n/a nM
Citation Mulvihill, MJKan, JLCooke, ABhagwat, SBeck, PBittner, MCesario, CKeane, DLazarescu, VNigro, ANillson, CPanicker, BSmith, VSrebernak, MSun, FLO'Connor, MRusso, SFischetti, GVrkljan, MWinski, SCastelhano, ALEmerson, DGibson, NW 3-[6-(2-Dimethylamino-1-imidazol-1-yl-butyl)-naphthalen-2-yloxy]-2,2-dimethyl-propionic acid as a highly potent and selective retinoic acid metabolic blocking agent. Bioorg Med Chem Lett16:2729-33 (2006) 
 
Cytochrome P450 3A4
Name:Cytochrome P450 3A4
Type:Enzyme
Mol. Mass.:57349.57
Organism:Homo sapiens (Human)
Description:n/a
Residue:503
BDBM50183238
NameBDBM50183238
Synonyms:3-(6-((1R,2R)-2-(butyl(methyl)amino)-1-(1H-imidazol-1-yl)propyl)naphthalen-2-yloxy)-2,2-dimethylpropanoic acid | CHEMBL205280
TypeSmall organic molecule
Emp. Form.C26H35N3O3
Mol. Mass.437.5744
SMILESCCCCN(C)[C@H](C)[C@@H](c1ccc2cc(OCC(C)(C)C(O)=O)ccc2c1)n1ccnc1