Reaction Details
TargetRNA-directed RNA polymerase
LigandBDBM50153250
Substrate/Competitorn/a
Meas. Tech.ChEMBL_337088 (CHEMBL862549)
IC50 9300±n/a nM
Citation Koch, UAttenni, BMalancona, SColarusso, SConte, IDi Filippo, MHarper, SPacini, BGiomini, CThomas, SIncitti, ITomei, LDe Francesco, RAltamura, SMatassa, VGNarjes, F 2-(2-Thienyl)-5,6-dihydroxy-4-carboxypyrimidines as inhibitors of the hepatitis C virus NS5B polymerase: discovery, SAR, modeling, and mutagenesis. J Med Chem49:1693-705 (2006) 
 
RNA-directed RNA polymerase
Name:RNA-directed RNA polymerase
Type:Protein
Mol. Mass.:25173.95
Organism:Hepatitis C virus
Description:Q8JXU8
Residue:229
BDBM50153250
NameBDBM50153250
Synonyms:5,6-Dihydroxy-2-thiophen-2-yl-pyrimidine-4-carboxylic acid 5,6-dihydroxy-2-(thiophen-2-yl)pyrimidine-4-carboxylic acid | CHEMBL181653
TypeSmall organic molecule
Emp. Form.C9H6N2O4S
Mol. Mass.238.22
SMILESOC(=O)c1nc([nH]c(=O)c1O)-c1cccs1