Reaction Details
TargetRNA-directed RNA polymerase
LigandBDBM50183482
Substrate/Competitorn/a
Meas. Tech.ChEMBL_337086 (CHEMBL862541)
IC50 80±n/a nM
Citation Koch, UAttenni, BMalancona, SColarusso, SConte, IDi Filippo, MHarper, SPacini, BGiomini, CThomas, SIncitti, ITomei, LDe Francesco, RAltamura, SMatassa, VGNarjes, F 2-(2-Thienyl)-5,6-dihydroxy-4-carboxypyrimidines as inhibitors of the hepatitis C virus NS5B polymerase: discovery, SAR, modeling, and mutagenesis. J Med Chem49:1693-705 (2006) 
 
RNA-directed RNA polymerase
Name:RNA-directed RNA polymerase
Type:Protein
Mol. Mass.:25173.95
Organism:Hepatitis C virus
Description:Q8JXU8
Residue:229
BDBM50183482
NameBDBM50183482
Synonyms:2-[3-({[(2-chlorobenzyl)amino]carbonyl}amino)-2-thienyl]-5-hydroxy-1-methyl-6-oxo-1,6-dihydropyrimidine-4-carboxylicAcid | CHEMBL203575
TypeSmall organic molecule
Emp. Form.C17H13ClN4O5S
Mol. Mass.420.827
SMILESCn1c(nc(C(O)=O)c(O)c1=O)-c1sccc1NC(=O)Nc1ccccc1Cl