Reaction Details
TargetcAMP-specific 3',5'-cyclic phosphodiesterase 4A
LigandBDBM50183800
Substrate/Competitorn/a
Meas. Tech.ChEMBL_353740 (CHEMBL866234)
IC50 1.8±n/a nM
Citation Lacombe, PDeschênes, DDubé, DDubé, LGallant, MMacdonald, DMastracchio, APerrier, HCharleson, SHuang, ZLaliberté, FLiu, SMancini, JAMasson, PSalem, MStyhler, AGirard, Y Nitrogen-bridged substituted 8-arylquinolines as potent PDE IV inhibitors. Bioorg Med Chem Lett16:2608-12 (2006) 
 
cAMP-specific 3',5'-cyclic phosphodiesterase 4A
Name:cAMP-specific 3',5'-cyclic phosphodiesterase 4A
Type:Enzyme
Mol. Mass.:98113.27
Organism:Homo sapiens (Human)
Description:P27815
Residue:886
BDBM50183800
NameBDBM50183800
Synonyms:3-isopropyl-1-(4-(methylsulfonyl)phenyl)-1-(1-(3-(6-(2-(methylsulfonyl)propan-2-yl)quinolin-8-yl)phenyl)ethyl)urea | CHEMBL207559
TypeSmall organic molecule
Emp. Form.C32H37N3O5S2
Mol. Mass.607.783
SMILESCC(C)NC(=O)N(C(C)c1cccc(c1)-c1cc(cc2cccnc12)C(C)(C)S(C)(=O)=O)c1ccc(cc1)S(C)(=O)=O