Reaction Details
TargetcAMP-specific 3',5'-cyclic phosphodiesterase 4A
LigandBDBM50183795
Substrate/Competitorn/a
Meas. Tech.ChEMBL_353740 (CHEMBL866234)
IC50 1±n/a nM
Citation Lacombe, PDeschênes, DDubé, DDubé, LGallant, MMacdonald, DMastracchio, APerrier, HCharleson, SHuang, ZLaliberté, FLiu, SMancini, JAMasson, PSalem, MStyhler, AGirard, Y Nitrogen-bridged substituted 8-arylquinolines as potent PDE IV inhibitors. Bioorg Med Chem Lett16:2608-12 (2006) 
 
cAMP-specific 3',5'-cyclic phosphodiesterase 4A
Name:cAMP-specific 3',5'-cyclic phosphodiesterase 4A
Type:Enzyme
Mol. Mass.:98113.27
Organism:Homo sapiens (Human)
Description:P27815
Residue:886
BDBM50183795
NameBDBM50183795
Synonyms:2-(8-(3-(((4-fluorobenzyl)(4-(methylsulfonyl)phenyl)amino)methyl)phenyl)quinolin-6-yl)-2-methylpropanenitrile | CHEMBL378681
TypeSmall organic molecule
Emp. Form.C34H30FN3O2S
Mol. Mass.563.684
SMILESCC(C)(C#N)c1cc(-c2cccc(CN(Cc3ccc(F)cc3)c3ccc(cc3)S(C)(=O)=O)c2)c2ncccc2c1