Reaction Details
TargetcAMP-specific 3',5'-cyclic phosphodiesterase 4C
LigandBDBM50183798
Substrate/Competitorn/a
Meas. Tech.ChEMBL_353750 (CHEMBL866913)
IC50 6.4±n/a nM
Citation Lacombe, PDeschênes, DDubé, DDubé, LGallant, MMacdonald, DMastracchio, APerrier, HCharleson, SHuang, ZLaliberté, FLiu, SMancini, JAMasson, PSalem, MStyhler, AGirard, Y Nitrogen-bridged substituted 8-arylquinolines as potent PDE IV inhibitors. Bioorg Med Chem Lett16:2608-12 (2006) 
 
cAMP-specific 3',5'-cyclic phosphodiesterase 4C
Name:cAMP-specific 3',5'-cyclic phosphodiesterase 4C
Type:Enzyme Catalytic Domain
Mol. Mass.:79875.54
Organism:Homo sapiens (Human)
Description:Q08493
Residue:712
BDBM50183798
NameBDBM50183798
Synonyms:1-((2-fluoro-5-(6-(2-(methylsulfonyl)propan-2-yl)quinolin-8-yl)phenyl)methyl)-3-isopropyl-1-(4-(methylsulfonyl)phenyl)urea | CHEMBL208100
TypeSmall organic molecule
Emp. Form.C31H34FN3O5S2
Mol. Mass.611.747
SMILESCC(C)NC(=O)N(Cc1cc(ccc1F)-c1cc(cc2cccnc12)C(C)(C)S(C)(=O)=O)c1ccc(cc1)S(C)(=O)=O