Reaction Details
TargetcAMP-specific 3',5'-cyclic phosphodiesterase 4B
LigandBDBM50183792
Substrate/Competitorn/a
Meas. Tech.ChEMBL_353749 (CHEMBL866912)
IC50 0.1±n/a nM
Citation Lacombe, PDeschênes, DDubé, DDubé, LGallant, MMacdonald, DMastracchio, APerrier, HCharleson, SHuang, ZLaliberté, FLiu, SMancini, JAMasson, PSalem, MStyhler, AGirard, Y Nitrogen-bridged substituted 8-arylquinolines as potent PDE IV inhibitors. Bioorg Med Chem Lett16:2608-12 (2006) 
 
cAMP-specific 3',5'-cyclic phosphodiesterase 4B
Name:cAMP-specific 3',5'-cyclic phosphodiesterase 4B
Type:Protein
Mol. Mass.:83318.87
Organism:Homo sapiens (Human)
Description:Q07343
Residue:736
BDBM50183792
NameBDBM50183792
Synonyms:1-((3-(6-(2-cyanopropan-2-yl)quinolin-8-yl)phenyl)methyl)-3-isopropyl-1-(4-(methylsulfonyl)phenyl)urea | CHEMBL382168
TypeSmall organic molecule
Emp. Form.C31H32N4O3S
Mol. Mass.540.676
SMILESCC(C)NC(=O)N(Cc1cccc(c1)-c1cc(cc2cccnc12)C(C)(C)C#N)c1ccc(cc1)S(C)(=O)=O