Reaction Details
TargetcAMP-specific 3',5'-cyclic phosphodiesterase 4C
LigandBDBM50183803
Substrate/Competitorn/a
Meas. Tech.ChEMBL_353750 (CHEMBL866913)
IC50 0.9±n/a nM
Citation Lacombe, PDeschênes, DDubé, DDubé, LGallant, MMacdonald, DMastracchio, APerrier, HCharleson, SHuang, ZLaliberté, FLiu, SMancini, JAMasson, PSalem, MStyhler, AGirard, Y Nitrogen-bridged substituted 8-arylquinolines as potent PDE IV inhibitors. Bioorg Med Chem Lett16:2608-12 (2006) 
 
cAMP-specific 3',5'-cyclic phosphodiesterase 4C
Name:cAMP-specific 3',5'-cyclic phosphodiesterase 4C
Type:Enzyme Catalytic Domain
Mol. Mass.:79875.54
Organism:Homo sapiens (Human)
Description:Q08493
Residue:712
BDBM50183803
NameBDBM50183803
Synonyms:CHEMBL206968 | N-((3-(6-(2-cyanopropan-2-yl)quinolin-8-yl)phenyl)methyl)-5-methyl-N-(4-(methylsulfonyl)phenyl)isoxazole-3-carboxamide
TypeSmall organic molecule
Emp. Form.C32H28N4O4S
Mol. Mass.564.654
SMILESCc1cc(no1)C(=O)N(Cc1cccc(c1)-c1cc(cc2cccnc12)C(C)(C)C#N)c1ccc(cc1)S(C)(=O)=O