Reaction Details
TargetcAMP-specific 3',5'-cyclic phosphodiesterase 4C
LigandBDBM50183802
Substrate/Competitorn/a
Meas. Tech.ChEMBL_353750 (CHEMBL866913)
IC50 17±n/a nM
Citation Lacombe, PDeschênes, DDubé, DDubé, LGallant, MMacdonald, DMastracchio, APerrier, HCharleson, SHuang, ZLaliberté, FLiu, SMancini, JAMasson, PSalem, MStyhler, AGirard, Y Nitrogen-bridged substituted 8-arylquinolines as potent PDE IV inhibitors. Bioorg Med Chem Lett16:2608-12 (2006) 
 
cAMP-specific 3',5'-cyclic phosphodiesterase 4C
Name:cAMP-specific 3',5'-cyclic phosphodiesterase 4C
Type:Enzyme Catalytic Domain
Mol. Mass.:79875.54
Organism:Homo sapiens (Human)
Description:Q08493
Residue:712
BDBM50183802
NameBDBM50183802
Synonyms:CHEMBL379768 | N-(4-(methylsulfonyl)phenyl)-N-(1-(3-(6-(2-(methylsulfonyl)propan-2-yl)quinolin-8-yl)phenyl)ethyl)cyclopropanecarboxamide
TypeSmall organic molecule
Emp. Form.C32H34N2O5S2
Mol. Mass.590.753
SMILESCC(N(C(=O)C1CC1)c1ccc(cc1)S(C)(=O)=O)c1cccc(c1)-c1cc(cc2cccnc12)C(C)(C)S(C)(=O)=O