Reaction Details
TargetcAMP-specific 3',5'-cyclic phosphodiesterase 4D
LigandBDBM50183808
Substrate/Competitorn/a
Meas. Tech.ChEMBL_353751 (CHEMBL866914)
IC50 0.3±n/a nM
Citation Lacombe, PDeschênes, DDubé, DDubé, LGallant, MMacdonald, DMastracchio, APerrier, HCharleson, SHuang, ZLaliberté, FLiu, SMancini, JAMasson, PSalem, MStyhler, AGirard, Y Nitrogen-bridged substituted 8-arylquinolines as potent PDE IV inhibitors. Bioorg Med Chem Lett16:2608-12 (2006) 
 
cAMP-specific 3',5'-cyclic phosphodiesterase 4D
Name:cAMP-specific 3',5'-cyclic phosphodiesterase 4D
Type:Protein
Mol. Mass.:91092.69
Organism:Homo sapiens (Human)
Description:Q08499
Residue:809
BDBM50183808
NameBDBM50183808
Synonyms:CHEMBL383225 | N-((3-(6-(2-cyanopropan-2-yl)quinolin-8-yl)phenyl)methyl)-N-(4-(methylsulfonyl)phenyl)benzamide
TypeSmall organic molecule
Emp. Form.C34H29N3O3S
Mol. Mass.559.677
SMILESCC(C)(C#N)c1cc(-c2cccc(CN(C(=O)c3ccccc3)c3ccc(cc3)S(C)(=O)=O)c2)c2ncccc2c1