Reaction Details
TargetcAMP-specific 3',5'-cyclic phosphodiesterase 4A
LigandBDBM50183801
Substrate/Competitorn/a
Meas. Tech.ChEMBL_353740 (CHEMBL866234)
IC50 3.5±n/a nM
Citation Lacombe, PDeschênes, DDubé, DDubé, LGallant, MMacdonald, DMastracchio, APerrier, HCharleson, SHuang, ZLaliberté, FLiu, SMancini, JAMasson, PSalem, MStyhler, AGirard, Y Nitrogen-bridged substituted 8-arylquinolines as potent PDE IV inhibitors. Bioorg Med Chem Lett16:2608-12 (2006) 
 
cAMP-specific 3',5'-cyclic phosphodiesterase 4A
Name:cAMP-specific 3',5'-cyclic phosphodiesterase 4A
Type:Enzyme
Mol. Mass.:98113.27
Organism:Homo sapiens (Human)
Description:P27815
Residue:886
BDBM50183801
NameBDBM50183801
Synonyms:CHEMBL208149 | N-(4-(methylsulfonyl)phenyl)-3-(6-(2-(methylsulfonyl)propan-2-yl)quinolin-8-yl)benzamide
TypeSmall organic molecule
Emp. Form.C27H26N2O5S2
Mol. Mass.522.636
SMILESCC(C)(c1cc(-c2cccc(c2)C(=O)Nc2ccc(cc2)S(C)(=O)=O)c2ncccc2c1)S(C)(=O)=O