Reaction Details
TargetMicrosomal triglyceride transfer protein large subunit
LigandBDBM50184109
Substrate/Competitorn/a
Meas. Tech.ChEMBL_364710 (CHEMBL866306)
IC50 1.64±n/a nM
Citation Li, JBertinato, PCheng, HCole, BMBronk, BSJaynes, BHHickman, AHaven, MLKolosko, NLBarry, CJManion, TB Discovery of potent and orally active MTP inhibitors as potential anti-obesity agents. Bioorg Med Chem Lett16:3039-42 (2006) 
 
Microsomal triglyceride transfer protein large subunit
Name:Microsomal triglyceride transfer protein large subunit
Type:PROTEIN
Mol. Mass.:99365.65
Organism:Homo sapiens (Human)
Description:ChEMBL_971724
Residue:894
BDBM50184109
NameBDBM50184109
Synonyms:4'-trifluoromethyl-biphenyl-2-carboxylic acid {2-methyl-4-[((S)-phenyl-propylcarbamoyl-methyl)-carbamoyl]-phenyl}-amide | CHEMBL382891
TypeSmall organic molecule
Emp. Form.C33H30F3N3O3
Mol. Mass.573.6048
SMILESCCCNC(=O)[C@@H](NC(=O)c1ccc(NC(=O)c2ccccc2-c2ccc(cc2)C(F)(F)F)c(C)c1)c1ccccc1