Reaction Details
TargetMicrosomal triglyceride transfer protein large subunit
LigandBDBM50184127
Substrate/Competitorn/a
Meas. Tech.ChEMBL_364710 (CHEMBL866306)
IC50 2.53±n/a nM
Citation Li, JBertinato, PCheng, HCole, BMBronk, BSJaynes, BHHickman, AHaven, MLKolosko, NLBarry, CJManion, TB Discovery of potent and orally active MTP inhibitors as potential anti-obesity agents. Bioorg Med Chem Lett16:3039-42 (2006) 
 
Microsomal triglyceride transfer protein large subunit
Name:Microsomal triglyceride transfer protein large subunit
Type:PROTEIN
Mol. Mass.:99365.65
Organism:Homo sapiens (Human)
Description:ChEMBL_971724
Residue:894
BDBM50184127
NameBDBM50184127
Synonyms:CHEMBL207443 | N-((S)-Phenyl-propylcarbamoyl-methyl)-6-[(4'-trifluoromethyl-biphenyl-2-carbonyl)-amino]-nicotinamide
TypeSmall organic molecule
Emp. Form.C31H27F3N4O3
Mol. Mass.560.5663
SMILESCCCNC(=O)[C@@H](NC(=O)c1ccc(NC(=O)c2ccccc2-c2ccc(cc2)C(F)(F)F)nc1)c1ccccc1