Reaction Details
TargetProstaglandin E2 receptor EP3 subtype
LigandBDBM50184215
Substrate/Competitorn/a
Meas. Tech.ChEMBL_364761 (CHEMBL854183)
Ki>300±n/a nM
Citation Sturino, CFLachance, NBoyd, MBerthelette, CLabelle, MLi, LRoy, BScheigetz, JTsou, NBrideau, CCauchon, ECarriere, MCDenis, DGreig, GKargman, SLamontagne, SMathieu, MCSawyer, NSlipetz, DO'Neill, GWang, ZZamboni, RMetters, KMYoung, RN Identification of an indole series of prostaglandin D2 receptor antagonists. Bioorg Med Chem Lett16:3043-8 (2006) 
 
Prostaglandin E2 receptor EP3 subtype
Name:Prostaglandin E2 receptor EP3 subtype
Type:Enzyme
Mol. Mass.:43335.03
Organism:Homo sapiens (Human)
Description:P43115
Residue:390
BDBM50184215
NameBDBM50184215
Synonyms:2-(9-(4-chlorobenzyl)-6,8-difluoro-2,3,4,9-tetrahydro-1H-carbazol-1-yl)acetic acid | CHEMBL208260
TypeSmall organic molecule
Emp. Form.C21H18ClF2NO2
Mol. Mass.389.823
SMILESOC(=O)CC1CCCc2c1n(Cc1ccc(Cl)cc1)c1c(F)cc(F)cc21