Reaction Details
TargetMelanocortin receptor 4
LigandBDBM50184354
Substrate/Competitorn/a
Meas. Tech.ChEMBL_338133 (CHEMBL867660)
IC50 34±n/a nM
Citation Mayorov, AVCai, MChandler, KBPetrov, RRVan Scoy, ARYu, ZTanaka, DKTrivedi, DHruby, VJ Development of cyclic gamma-MSH analogues with selective hMC3R agonist and hMC3R/hMC5R antagonist activities. J Med Chem49:1946-52 (2006) 
 
Melanocortin receptor 4
Name:Melanocortin receptor 4
Type:Enzyme
Mol. Mass.:36949.50
Organism:Homo sapiens (Human)
Description:P32245
Residue:332
BDBM50184354
NameBDBM50184354
Synonyms:CHEMBL383250 | c[Nle-Glu-D-Nal(2')-Arg-Trp-Glu]-NH2
TypeSmall organic molecule
Emp. Form.C46H59N11O9
Mol. Mass.910.029
SMILESCCCC[C@@H]1NC(=O)CC[C@H](NC(=O)[C@H](Cc2c[nH]c3ccccc23)NC(=O)[C@H](CCCN=C(N)N)NC(=O)[C@@H](Cc2ccc3ccccc3c2)NC(=O)[C@H](CCC(O)=O)NC1=O)C(N)=O