Reaction Details
TargetMelanin-concentrating hormone receptor 1
LigandBDBM50185045
Substrate/Competitorn/a
Meas. Tech.ChEMBL_343377 (CHEMBL860697)
IC50 57±n/a nM
Citation Kym, PRSouers, AJCampbell, TJLynch, JKJudd, ASIyengar, RVasudevan, AGao, JFreeman, JCWodka, DMulhern, MZhao, GWagaw, SHNapier, JJBrodjian, SDayton, BDReilly, RMSegreti, JAFryer, RMPreusser, LCReinhart, GAHernandez, LMarsh, KCSham, HLCollins, CAPolakowski, JS Screening for cardiovascular safety: a structure-activity approach for guiding lead selection of melanin concentrating hormone receptor 1 antagonists. J Med Chem49:2339-52 (2006) 
 
Melanin-concentrating hormone receptor 1
Name:Melanin-concentrating hormone receptor 1
Type:G Protein-Coupled Receptor (GPCR)
Mol. Mass.:45976.27
Organism:Homo sapiens (Human)
Description:Membranes from CHO-K1 cells stably expressing human MCH1R were used in assays.
Residue:422
BDBM50185045
NameBDBM50185045
Synonyms:CHEMBL383076 | N-{2-[2-(3-(S)-hydroxypyrrolidin-1-yl)ethyl]-2H-indazol-5-yl}-N'-(4-phenoxyphenyl)urea
TypeSmall organic molecule
Emp. Form.C26H27N5O3
Mol. Mass.457.5243
SMILESO[C@H]1CCN(CCn2cc3cc(NC(=O)Nc4ccc(Oc5ccccc5)cc4)ccc3n2)C1