Reaction Details
TargetMelanin-concentrating hormone receptor 1
LigandBDBM50167567
Substrate/Competitorn/a
Meas. Tech.ChEMBL_343377 (CHEMBL860697)
IC50 12±n/a nM
Citation Kym, PRSouers, AJCampbell, TJLynch, JKJudd, ASIyengar, RVasudevan, AGao, JFreeman, JCWodka, DMulhern, MZhao, GWagaw, SHNapier, JJBrodjian, SDayton, BDReilly, RMSegreti, JAFryer, RMPreusser, LCReinhart, GAHernandez, LMarsh, KCSham, HLCollins, CAPolakowski, JS Screening for cardiovascular safety: a structure-activity approach for guiding lead selection of melanin concentrating hormone receptor 1 antagonists. J Med Chem49:2339-52 (2006) 
 
Melanin-concentrating hormone receptor 1
Name:Melanin-concentrating hormone receptor 1
Type:G Protein-Coupled Receptor (GPCR)
Mol. Mass.:45976.27
Organism:Homo sapiens (Human)
Description:Membranes from CHO-K1 cells stably expressing human MCH1R were used in assays.
Residue:422
BDBM50167567
NameBDBM50167567
Synonyms:1-(4-Phenoxy-phenyl)-3-[1-(2-pyrrolidin-1-yl-ethyl)-1H-indazol-5-yl]-urea N-(4-phenoxyphenyl)-N'-[1-(2-pyrrolidin-1-ylethyl)-1H-indazol-5-yl]urea
TypeSmall organic molecule
Emp. Form.C26H27N5O2
Mol. Mass.441.5249
SMILESO=C(Nc1ccc(Oc2ccccc2)cc1)Nc1ccc2n(CCN3CCCC3)ncc2c1