Reaction Details
TargetSphingosine 1-phosphate receptor 5
LigandBDBM50185142
Substrate/Competitorn/a
Meas. Tech.ChEMBL_358034 (CHEMBL871183)
IC50 80±n/a nM
Citation Colandrea, VJLegiec, IEHuo, PYan, LHale, JJMills, SGBergstrom, JCard, DChebret, GHajdu, RKeohane, CAMilligan, JARosenbach, MJShei, GJMandala, SM 2,5-Disubstituted pyrrolidine carboxylates as potent, orally active sphingosine-1-phosphate (S1P) receptor agonists. Bioorg Med Chem Lett16:2905-8 (2006) 
 
Sphingosine 1-phosphate receptor 5
Name:Sphingosine 1-phosphate receptor 5
Type:G Protein-Coupled Receptor (GPCR)
Mol. Mass.:41796.42
Organism:Homo sapiens (Human)
Description:n/a
Residue:398
BDBM50185142
NameBDBM50185142
Synonyms:(+/-)-3-(trans-5-(4-(5-(4-isobutylphenyl)-1,2,4-oxadiazol-3-yl)phenyl)pyrrolidin-2-yl)propanoic acid | CHEMBL210468
TypeSmall organic molecule
Emp. Form.C25H29N3O3
Mol. Mass.419.5161
SMILESCC(C)Cc1ccc(cc1)-c1nc(no1)-c1ccc(cc1)[C@@H]1CC[C@@H](CCC(O)=O)N1