Reaction Details
TargetSphingosine 1-phosphate receptor 3
LigandBDBM50185148
Substrate/Competitorn/a
Meas. Tech.ChEMBL_358032 (CHEMBL853138)
IC50>10000±n/a nM
Citation Colandrea, VJLegiec, IEHuo, PYan, LHale, JJMills, SGBergstrom, JCard, DChebret, GHajdu, RKeohane, CAMilligan, JARosenbach, MJShei, GJMandala, SM 2,5-Disubstituted pyrrolidine carboxylates as potent, orally active sphingosine-1-phosphate (S1P) receptor agonists. Bioorg Med Chem Lett16:2905-8 (2006) 
 
Sphingosine 1-phosphate receptor 3
Name:Sphingosine 1-phosphate receptor 3
Type:G Protein-Coupled Receptor (GPCR)
Mol. Mass.:42278.13
Organism:Homo sapiens (Human)
Description:Q99500
Residue:378
BDBM50185148
NameBDBM50185148
Synonyms:(+/-)-cis-5-(4-(5-(4-isobutylphenyl)-1,2,4-oxadiazol-3-yl)phenyl)pyrrolidine-2-carboxylic acid | CHEMBL207580
TypeSmall organic molecule
Emp. Form.C23H25N3O3
Mol. Mass.391.4629
SMILESCC(C)Cc1ccc(cc1)-c1nc(no1)-c1ccc(cc1)[C@H]1CC[C@H](N1)C(O)=O