Reaction Details
TargetSphingosine 1-phosphate receptor 3
LigandBDBM50185143
Substrate/Competitorn/a
Meas. Tech.ChEMBL_358032 (CHEMBL853138)
IC50 1700±n/a nM
Citation Colandrea, VJLegiec, IEHuo, PYan, LHale, JJMills, SGBergstrom, JCard, DChebret, GHajdu, RKeohane, CAMilligan, JARosenbach, MJShei, GJMandala, SM 2,5-Disubstituted pyrrolidine carboxylates as potent, orally active sphingosine-1-phosphate (S1P) receptor agonists. Bioorg Med Chem Lett16:2905-8 (2006) 
 
Sphingosine 1-phosphate receptor 3
Name:Sphingosine 1-phosphate receptor 3
Type:G Protein-Coupled Receptor (GPCR)
Mol. Mass.:42278.13
Organism:Homo sapiens (Human)
Description:Q99500
Residue:378
BDBM50185143
NameBDBM50185143
Synonyms:(+/-)-2-(cis-5-(4-(5-(4-cyclohexylphenyl)-1,2,4-oxadiazol-3-yl)phenyl)pyrrolidin-2-yl)acetic acid | CHEMBL210520
TypeSmall organic molecule
Emp. Form.C26H29N3O3
Mol. Mass.431.5268
SMILESOC(=O)C[C@@H]1CC[C@@H](N1)c1ccc(cc1)-c1noc(n1)-c1ccc(cc1)C1CCCCC1