Reaction Details
TargetCholinesterase
LigandBDBM50604405
Substrate/Competitorn/a
Meas. Tech.ChEMBL_2247720 (CHEMBL5161930)
Ki 0.180000±n/a nM
Citation Meden, AKnez, DBrazzolotto, XNachon, FDias, JSvete, JStojan, JGro?elj, UGobec, S From tryptophan-based amides to tertiary amines: Optimization of a butyrylcholinesterase inhibitor series. Eur J Med Chem234:0 (2022) 
 
Cholinesterase
Name:Cholinesterase
Type:Homotetramer
Mol. Mass.:68422.27
Organism:Homo sapiens (Human)
Description:P06276
Residue:602
BDBM50604405
NameBDBM50604405
Synonyms:CHEMBL5186889
TypeSmall organic molecule
Emp. Form.C27H42N2O2
Mol. Mass.426.6346
SMILESCCCCN(CCC1CCCCCC1)CCc1c[nH]c2c(OC(=O)C(C)C)cccc12