Reaction Details
TargetDelta-type opioid receptor
LigandBDBM50185801
Substrate/Competitorn/a
Meas. Tech.ChEMBL_372755 (CHEMBL871099)
Ki>5000±n/a nM
Citation Bignan, GCBattista, KConnolly, PJOrsini, MJLiu, JMiddleton, SAReitz, AB 3-(4-Piperidinyl)indoles and 3-(4-piperidinyl)pyrrolo-[2,3-b]pyridines as ligands for the ORL-1 receptor. Bioorg Med Chem Lett16:3524-8 (2006) 
 
Delta-type opioid receptor
Name:Delta-type opioid receptor
Type:G Protein-Coupled Receptor (GPCR)
Mol. Mass.:40382.98
Organism:Homo sapiens (Human)
Description:Competition binding assays were carried out using membrane preparations from transfected HN9.10 cells that constitutively expressed the delta opioid receptor.
Residue:372
BDBM50185801
NameBDBM50185801
Synonyms:1-(1,2-dihydroacenaphthylen-1-yl)-4-(1-methyl-1H-pyrrolo[2,3-b]pyridin-3-yl)piperidin-3-yl acetate | CHEMBL212571
TypeSmall organic molecule
Emp. Form.C27H27N3O2
Mol. Mass.425.5222
SMILESCC(=O)OC1CN(CCC1c1cn(C)c2ncccc12)C1Cc2cccc3cccc1c23