Reaction Details
TargetKappa-type opioid receptor
LigandBDBM50185787
Substrate/Competitorn/a
Meas. Tech.ChEMBL_372754 (CHEMBL871098)
Ki>5000±n/a nM
Citation Bignan, GCBattista, KConnolly, PJOrsini, MJLiu, JMiddleton, SAReitz, AB 3-(4-Piperidinyl)indoles and 3-(4-piperidinyl)pyrrolo-[2,3-b]pyridines as ligands for the ORL-1 receptor. Bioorg Med Chem Lett16:3524-8 (2006) 
 
Kappa-type opioid receptor
Name:Kappa-type opioid receptor
Type:G Protein-Coupled Receptor (GPCR)
Mol. Mass.:42648.76
Organism:Homo sapiens (Human)
Description:P41145
Residue:380
BDBM50185787
NameBDBM50185787
Synonyms:3-(1-(cyclohexylmethyl)piperidin-4-yl)-1H-pyrrolo[2,3-b]pyridine | CHEMBL211210
TypeSmall organic molecule
Emp. Form.C19H27N3
Mol. Mass.297.4378
SMILESC(C1CCCCC1)N1CCC(CC1)c1c[nH]c2ncccc12