Reaction Details
TargetKappa-type opioid receptor
LigandBDBM50185807
Substrate/Competitorn/a
Meas. Tech.ChEMBL_372754 (CHEMBL871098)
Ki 330±n/a nM
Citation Bignan, GCBattista, KConnolly, PJOrsini, MJLiu, JMiddleton, SAReitz, AB 3-(4-Piperidinyl)indoles and 3-(4-piperidinyl)pyrrolo-[2,3-b]pyridines as ligands for the ORL-1 receptor. Bioorg Med Chem Lett16:3524-8 (2006) 
 
Kappa-type opioid receptor
Name:Kappa-type opioid receptor
Type:G Protein-Coupled Receptor (GPCR)
Mol. Mass.:42648.76
Organism:Homo sapiens (Human)
Description:P41145
Residue:380
BDBM50185807
NameBDBM50185807
Synonyms:5-chloro-3-(1-(cyclooctylmethyl)piperidin-4-yl)-2-methyl-1H-indole | CHEMBL212574
TypeSmall organic molecule
Emp. Form.C23H33ClN2
Mol. Mass.372.975
SMILESCc1[nH]c2ccc(Cl)cc2c1C1CCN(CC2CCCCCCC2)CC1