Reaction Details
TargetKappa-type opioid receptor
LigandBDBM50185797
Substrate/Competitorn/a
Meas. Tech.ChEMBL_372754 (CHEMBL871098)
Ki>5000±n/a nM
Citation Bignan, GCBattista, KConnolly, PJOrsini, MJLiu, JMiddleton, SAReitz, AB 3-(4-Piperidinyl)indoles and 3-(4-piperidinyl)pyrrolo-[2,3-b]pyridines as ligands for the ORL-1 receptor. Bioorg Med Chem Lett16:3524-8 (2006) 
 
Kappa-type opioid receptor
Name:Kappa-type opioid receptor
Type:G Protein-Coupled Receptor (GPCR)
Mol. Mass.:42648.76
Organism:Homo sapiens (Human)
Description:P41145
Residue:380
BDBM50185797
NameBDBM50185797
Synonyms:1-((R)-3-amino-2-hydroxypropyl)-3-(1-(1,2-dihydroacenaphthylen-1-yl)-1,2,3,6-tetrahydropyridin-4-yl)-1H-indole-5-carbonitrile | CHEMBL378453
TypeSmall organic molecule
Emp. Form.C29H28N4O
Mol. Mass.448.5588
SMILESNC[C@@H](O)Cn1cc(C2=CCN(CC2)C2Cc3cccc4cccc2c34)c2cc(ccc12)C#N