Reaction Details
TargetKappa-type opioid receptor
LigandBDBM50185804
Substrate/Competitorn/a
Meas. Tech.ChEMBL_372754 (CHEMBL871098)
Ki>5000±n/a nM
Citation Bignan, GCBattista, KConnolly, PJOrsini, MJLiu, JMiddleton, SAReitz, AB 3-(4-Piperidinyl)indoles and 3-(4-piperidinyl)pyrrolo-[2,3-b]pyridines as ligands for the ORL-1 receptor. Bioorg Med Chem Lett16:3524-8 (2006) 
 
Kappa-type opioid receptor
Name:Kappa-type opioid receptor
Type:G Protein-Coupled Receptor (GPCR)
Mol. Mass.:42648.76
Organism:Homo sapiens (Human)
Description:P41145
Residue:380
BDBM50185804
NameBDBM50185804
Synonyms:1-benzyl-6-chloro-3-(1-(1,2-dihydroacenaphthylen-1-yl)piperidin-4-yl)-1H-indole | CHEMBL376964
TypeSmall organic molecule
Emp. Form.C32H29ClN2
Mol. Mass.477.039
SMILESClc1ccc2c(cn(Cc3ccccc3)c2c1)C1CCN(CC1)C1Cc2cccc3cccc1c23